{"text_format":"1","workbook":"xlsx","n_sheets":3,"sheets":["入力シート","保存シート","リスト"],"not_rendered":{"charts":2,"images":0,"macros":1,"external_links":0,"defined_names":26,"comments":0,"pivot_tables":0},"unopened":[],"bounds":{"document_bytes":16777216,"sheet_cells":100000,"rows_first":2000,"rows_last":500,"rows_between":2000,"halvings":0,"cell_chars":16384,"cell_head_chars":4096},"cells_cut":0,"cells_raw":0,"read":"whole","date_system":"1900"}

{"sheet":"入力シート","index":0,"n_rows":40,"n_cols":84,"rows_kept":40,"cut":false,"hidden":false,"merged":[[0,0,1,20],[3,0,3,1],[3,2,3,3],[4,0,4,2],[4,3,4,8],[4,9,4,12],[4,13,4,20],[7,0,7,2],[7,3,7,8],[8,0,8,2],[8,3,8,4],[8,12,8,13],[8,14,8,15],[7,15,7,16],[7,17,7,18],[35,1,35,6],[34,1,34,6],[33,1,33,6],[32,1,32,6],[31,1,31,6],[30,1,30,6],[11,0,14,0],[15,0,19,0],[20,0,37,0],[11,1,11,6],[37,1,37,6],[36,1,36,6],[23,1,23,6],[22,1,22,6],[21,1,21,6],[20,1,20,6],[19,1,19,6],[18,1,18,6],[29,1,29,6],[28,1,28,6],[27,1,27,6],[26,1,26,6],[25,1,25,6],[24,1,24,6],[10,7,10,13],[11,7,11,13],[10,14,10,20],[11,14,11,20],[12,7,12,13],[13,7,13,13],[17,1,17,6],[16,1,16,6],[15,1,15,6],[14,1,14,6],[13,1,13,6],[12,1,12,6],[10,1,10,6],[28,7,28,13],[27,7,27,13],[26,7,26,13],[25,7,25,13],[24,7,24,13],[23,7,23,13],[14,7,14,13],[37,7,37,13],[36,7,36,13],[35,7,35,13],[34,7,34,13],[33,7,33,13],[32,7,32,13],[31,7,31,13],[30,7,30,13],[29,7,29,13],[12,14,12,20],[13,14,13,20],[14,14,14,20],[15,14,15,20],[16,14,16,20],[22,7,22,13],[21,7,21,13],[20,7,20,13],[19,7,19,13],[18,7,18,13],[17,7,17,13],[35,14,35,20],[36,14,36,20],[37,14,37,20],[7,11,7,12],[29,14,29,20],[30,14,30,20],[31,14,31,20],[32,14,32,20],[33,14,33,20],[34,14,34,20],[23,14,23,20],[24,14,24,20],[25,14,25,20],[26,14,26,20],[27,14,27,20],[28,14,28,20],[17,14,17,20],[18,14,18,20],[19,14,19,20],[20,14,20,20],[21,14,21,20],[22,14,22,20],[16,7,16,13],[15,7,15,13]]}
["子どもの状況と環境サマリーシート\nver.1.0"]
[]
["（1）記入者情報"]
["記入日：",null,null,null,"年",null,"月",null,"日"]
["記入者氏名：",null,null,null,null,null,null,null,null,"記入者種別："]
[]
["（2）対象者情報"]
["対象者氏名：",null,null,null,null,null,null,null,null,null,null,"年齢：",null,{"$f":"IF(OR(C4=\"\",F4=\"\",H4=\"\",D9=\"\",G9=\"\",I9=\"\"),\"\",DATEDIF(DATE(D9,G9,I9),DATE(C4,F4,H4),\"Y\"))","v":""},"歳","月齢：",null,{"$f":"IF(OR(C4=\"\",F4=\"\",H4=\"\",D9=\"\",G9=\"\",I9=\"\"),\"\",DATEDIF(DATE(D9,G9,I9),DATE(C4,F4,H4),\"M\"))","v":""},null,"か月"]
["生年月日：",null,null,null,null,"年",null,"月",null,"日",null,null,"性別："]
[]
[null,"項目",null,null,null,null,null,"回答",null,null,null,null,null,null,"具体例"]
["家族要因","家庭の暮らし向き"]
[null,"保護者のメンタルヘルス"]
[null,"養育の困難感"]
[null,"家族・親族のサポート"]
["社会資源","自治体の保険領域でのサポート"]
[null,"園や学校でのサポート"]
[null,"利用可能な地域の福祉サービス資源"]
[null,"福祉・療育機関でのサポート"]
[null,"医療機関でのサポート"]
["子ども要因","登園・登校状況"]
[null,"知的水準・学校の成績"]
[null,"対人関係"]
[null,"コミュニケーション"]
[null,"こだわり"]
[null,"多動・衝動性"]
[null,"注意・集中力"]
[null,"感覚の問題"]
[null,"読み書き"]
[null,"運動・不器用"]
[null,"身辺自立"]
[null,"睡眠"]
[null,"不安・緘黙"]
[null,"自傷・他害行動"]
[null,"いじめの被害"]
[null,"身体状態（病弱）"]
[null,"服薬状況"]
[null,"その他"]
[null,null,null,null,null,null,null,null,null,null,null,null,null,null,null,null,null,null,null,null,null,"チェック","対象者氏名","年齢","月齢","性別","生年月日","記入日","記入者氏名","記入者種別","家庭の暮らし向き","保護者のメンタルヘルス","養育の困難感","家族・親族のサポート","自治体の保険領域でのサポート","園や学校でのサポート","利用可能な地域の福祉サービス資源","福祉・療育機関でのサポート","医療機関でのサポート","登園・登校状況","知的水準・学校の成績","対人関係","コミュニケーション","こだわり","多動・衝動性","注意・集中力","感覚の問題","読み書き","運動・不器用","身辺自立","睡眠","不安・緘黙","自傷・他害行動","いじめの被害","身体状態（病弱）","服薬状況","その他","・家庭の暮らし向き：","・保護者のメンタルヘルス：","・養育の困難感：","・家族・親族のサポート：","・自治体の保険領域でのサポート：","・園や学校でのサポート：","・利用可能な地域の福祉サービス資源：","・福祉・療育機関でのサポート：","・医療機関でのサポート：","・登園・登校状況：","・知的水準・学校の成績：","・対人関係：","・コミュニケーション：","・こだわり：","・多動・衝動性：","・注意・集中力：","・感覚の問題：","・読み書き：","・運動・不器用：","・身辺自立：","・睡眠：","・不安・緘黙：","・自傷・他害行動：","・いじめの被害：","・身体状態（病弱）：","・服薬状況：","・その他："]
[null,null,null,null,null,null,null,null,null,null,null,null,null,null,null,null,null,null,null,null,null,{"$f":"IF(OR(C4=\"\",F4=\"\",H4=\"\",D5=\"\",N5=\"\",D8=\"\",D9=\"\",G9=\"\",I9=\"\",O9=\"\",H12=\"\",H13=\"\",H14=\"\",H15=\"\",H16=\"\",H17=\"\",H18=\"\",H19=\"\",H20=\"\",H21=\"\",H22=\"\",H23=\"\",H24=\"\",H25=\"\",H26=\"\",H27=\"\",H28=\"\",H29=\"\",H30=\"\",H31=\"\",H32=\"\",H33=\"\",H34=\"\",H35=\"\",H36=\"\",H37=\"\")=TRUE, 1, 0)","v":1},{"$f":"D8","v":0},{"$f":"N8","v":""},{"$f":"R8","v":""},{"$f":"O9","v":0},{"$f":"DATE(D9, G9, I9)","v":{"$error":"#NUM!"}},{"$f":"DATE(C4,F4,H4)","v":{"$error":"#NUM!"}},{"$f":"D5","v":0},{"$f":"N5","v":0},{"$f":"H12","v":0},{"$f":"H13","v":0},{"$f":"H14","v":0},{"$f":"H15","v":0},{"$f":"H16","v":0},{"$f":"H17","v":0},{"$f":"H18","v":0},{"$f":"H19","v":0},{"$f":"H20","v":0},{"$f":"H21","v":0},{"$f":"H22","v":0},{"$f":"H23","v":0},{"$f":"H24","v":0},{"$f":"H25","v":0},{"$f":"H26","v":0},{"$f":"H27","v":0},{"$f":"H28","v":0},{"$f":"H29","v":0},{"$f":"H30","v":0},{"$f":"H31","v":0},{"$f":"H32","v":0},{"$f":"H33","v":0},{"$f":"H34","v":0},{"$f":"H35","v":0},{"$f":"H36","v":0},{"$f":"H37","v":0},null,{"$f":"O12","v":0},{"$f":"O13","v":0},{"$f":"O14","v":0},{"$f":"O15","v":0},{"$f":"O16","v":0},{"$f":"O17","v":0},{"$f":"O18","v":0},{"$f":"O19","v":0},{"$f":"O20","v":0},{"$f":"O21","v":0},{"$f":"O22","v":0},{"$f":"O23","v":0},{"$f":"O24","v":0},{"$f":"O25","v":0},{"$f":"O26","v":0},{"$f":"O27","v":0},{"$f":"O28","v":0},{"$f":"O29","v":0},{"$f":"O30","v":0},{"$f":"O31","v":0},{"$f":"O32","v":0},{"$f":"O33","v":0},{"$f":"O34","v":0},{"$f":"O35","v":0},{"$f":"O36","v":0},{"$f":"O37","v":0},{"$f":"O38","v":0}]

{"sheet":"保存シート","index":1,"n_rows":70,"n_cols":89,"rows_kept":70,"cut":false,"hidden":false,"merged":[[4,0,5,20],[6,0,7,20],[32,0,37,20],[0,32,2,32],[0,0,1,20],[0,27,2,27],[0,28,2,28],[0,29,2,29],[0,30,2,30],[0,31,2,31],[2,0,3,20]]}
["子どもの状況と環境サマリーシート\nver.1.0",null,null,null,null,null,null,null,null,null,null,null,null,null,null,null,null,null,null,null,null,null,null,null,null,null,null,"表示No.\n（1つ目）",0,"表示No.\n（2つ目）",1,"表示No.\n（3つ目）",2]
[]
[{"$f":"\"（1）対象者：\"&W$5&\" ／ 年齢（月齢）：\"&W$6&\"歳（\"&W$7&\"か月）\"&\" ／ 性別：\"&W$8&CHAR(10)&\"　　  記入日：\"&TEXT(W$9, \"YYYY年MM月DD日\")&\" ／ 記入者（種別）：\"&W$10&\"（\"&W$11&\"）\"","v":"（1）対象者：xyz ／ 年齢（月齢）：7歳（85か月） ／ 性別：男\n　　  記入日：2025年06月23日 ／ 記入者（種別）：abc（2. 医療機関）"}]
[null,null,null,null,null,null,null,null,null,null,null,null,null,null,null,null,null,null,null,null,null,null,1,2,3,null,"No.","対象者氏名","年齢","月齢","性別","生年月日","記入日","記入者氏名","記入者種別","家庭の暮らし向き","保護者のメンタルヘルス","養育の困難感","家族・親族のサポート","自治体の保険領域でのサポート","園や学校でのサポート","利用可能な地域の福祉サービス資源","福祉・療育機関でのサポート","医療機関でのサポート","登園・登校状況","知的水準・学校の成績","対人関係","コミュニケーション","こだわり","多動・衝動性","注意・集中力","感覚の問題","読み書き","運動・不器用","身辺自立","睡眠","不安・緘黙","自傷・他害行動","いじめの被害","身体状態（病弱）","服薬状況","その他","・家庭の暮らし向き：","・保護者のメンタルヘルス：","・養育の困難感：","・家族・親族のサポート：","・自治体の保険領域でのサポート：","・園や学校でのサポート：","・利用可能な地域の福祉サービス資源：","・福祉・療育機関でのサポート：","・医療機関でのサポート：","・登園・登校状況：","・知的水準・学校の成績：","・対人関係：","・コミュニケーション：","・こだわり：","・多動・衝動性：","・注意・集中力：","・感覚の問題：","・読み書き：","・運動・不器用：","・身辺自立：","・睡眠：","・不安・緘黙：","・自傷・他害行動：","・いじめの被害：","・身体状態（病弱）：","・服薬状況：","・その他："]
[{"$f":"IF($AE$1=\"\", \"\", \"（2）対象者：\"&X$5&\" ／ 年齢（月齢）：\"&X$6&\"歳（\"&X$7&\"か月）\"&\" ／ 性別：\"&X$8&CHAR(10)&\"　　  記入日：\"&TEXT(X$9, \"YYYY年MM月DD日\")&\" ／ 記入者（種別）：\"&X$10&\"（\"&X$11&\"）\")","v":"（2）対象者：xyz ／ 年齢（月齢）：7歳（85か月） ／ 性別：男\n　　  記入日：2025年06月24日 ／ 記入者（種別）：def（3. 保育所・幼稚園・こども園・学校）"},null,null,null,null,null,null,null,null,null,null,null,null,null,null,null,null,null,null,null,null,"対象者氏名",{"$f":"IF($AC$1=\"\",\"\",INDEX($AB$5:$AB$300,MATCH($AC$1,$AA$5:$AA$300,0)))","v":"xyz"},{"$f":"IF($AE$1=\"\",\"\",INDEX($AB$5:$AB$300,MATCH($AE$1,$AA$5:$AA$300,0)))","v":"xyz"},{"$f":"IF($AG$1=\"\",\"\",INDEX($AB$5:$AB$300,MATCH($AG$1,$AA$5:$AA$300,0)))","v":"xyz"},null,0,"xyz",7,85,"1. 男","2018-05-06","2025-06-23","abc","2. 医療機関","3. どちらともいえない","1. 非常に安定している","5. 対応に非常に苦慮している","3. 必要時に最低限","3. 必要時に最低限","3. 必要時に最低限","3. 必要に応じて受けられる","3. 必要時に最低限","3. 必要時に最低限","1. 毎日喜んで登校している","4. 軽度の遅れがある／制限がある","3. 年齢相応","1. 非常に良い","5. 非常に困難","5. 多動衝動性が非常に目立つ","5. 不注意が非常に目立つ","3. 年齢相応","3. 年齢相応","3. 年齢相応","1. 非常に良い","1. 非常に良い","1. 非常に安定している","5. 中度／重度の問題","5. 中度／重度の問題","3. どちらともいえない","5. 多剤併用や副作用が強く調整が必要",null,0,0,0,0,0,0,0,0,0,0,0,0,0,0,0,0,0,0,0,0,0,0,0,0,0,0,0]
[null,null,null,null,null,null,null,null,null,null,null,null,null,null,null,null,null,null,null,null,null,"年齢",{"$f":"IF($AC$1=\"\",\"\",INDEX($AC$5:$AC$300,MATCH($AC$1,$AA$5:$AA$300,0)))","v":7},{"$f":"IF($AE$1=\"\",\"\",INDEX($AC$5:$AC$300,MATCH($AE$1,$AA$5:$AA$300,0)))","v":7},{"$f":"IF($AG$1=\"\",\"\",INDEX($AC$5:$AC$300,MATCH($AG$1,$AA$5:$AA$300,0)))","v":7},null,{"$f":"IF(AB5=\"\", \"\", AA5+1)","v":1},"xyz",7,85,"1. 男","2018-05-06","2025-06-24","def","3. 保育所・幼稚園・こども園・学校","2. ゆとりがある","1. 非常に安定している","2. 対応できる","2. 十分","2. 十分","1. 手厚い","3. 必要に応じて受けられる","3. 必要時に最低限","3. 必要時に最低限","4. 時々休む","4. 軽度の遅れがある／制限がある","2. 良い","3. 年齢相応","4. 困難","3. 年齢相応","4. 不注意が目立つ","3. 年齢相応","4. 困難","3. 年齢相応","3. 年齢相応","2. 良い","2. 安定している","3. ない","3. ない","2. 健康","3. 服薬の必要がない",null,0,0,0,0,0,0,0,0,0,"毎週月曜日は登校を渋る","一部の強化についていけない",0,0,0,0,0,0,0,0,0,0,0,0,0,0,0,"早急な対応は必要ないが，今後が心配"]
[{"$f":"IF($AG$1=\"\", \"\", \"（3）対象者：\"&Y$5&\" ／ 年齢（月齢）：\"&Y$6&\"歳（\"&Y$7&\"か月）\"&\" ／ 性別：\"&Y$8&CHAR(10)&\"　　  記入日：\"&TEXT(Y$9, \"YYYY年MM月DD日\")&\" ／ 記入者（種別）：\"&Y$10&\"（\"&Y$11&\"）\")","v":"（3）対象者：xyz ／ 年齢（月齢）：7歳（85か月） ／ 性別：男\n　　  記入日：2025年06月25日 ／ 記入者（種別）：ghi（1. 自治体）"},null,null,null,null,null,null,null,null,null,null,null,null,null,null,null,null,null,null,null,null,"月齢）",{"$f":"IF($AC$1=\"\",\"\",INDEX($AD$5:$AD$300,MATCH($AC$1,$AA$5:$AA$300,0)))","v":85},{"$f":"IF($AE$1=\"\",\"\",INDEX($AD$5:$AD$300,MATCH($AE$1,$AA$5:$AA$300,0)))","v":85},{"$f":"IF($AG$1=\"\",\"\",INDEX($AD$5:$AD$300,MATCH($AG$1,$AA$5:$AA$300,0)))","v":85},null,2,"xyz",7,85,"1. 男","2018-05-06","2025-06-25","ghi","1. 自治体","2. ゆとりがある","3. どちらともいえない","3. 何とか対応できる","2. 十分","1. 手厚い","1. 手厚い","2. 充実している","2. 十分","3. 必要時に最低限","3. 登校をしぶるが登校している","3. 年齢相応","2. 良い","3. 年齢相応","4. 困難","4. 多動・衝動性が目立つ","4. 不注意が目立つ","3. 年齢相応","3. 年齢相応","2. 良い","3. 年齢相応","2. 良い","2. 安定している","3. ない","3. ない","2. 健康","3. 服薬の必要がない",null,0,0,0,0,0,0,0,0,0,0,0,0,0,0,0,0,0,0,0,0,0,0,0,0,0,0,0]
[null,null,null,null,null,null,null,null,null,null,null,null,null,null,null,null,null,null,null,null,null,"性別",{"$f":"IF($AC$1=\"\",\"\",RIGHT(INDEX($AE$5:$AE$300,MATCH($AC$1,$AA$5:$AA$300,0)), 1))","v":"男"},{"$f":"IF($AE$1=\"\",\"\",RIGHT(INDEX($AE$5:$AE$300,MATCH($AE$1,$AA$5:$AA$300,0)), 1))","v":"男"},{"$f":"IF($AG$1=\"\",\"\",RIGHT(INDEX($AE$5:$AE$300,MATCH($AG$1,$AA$5:$AA$300,0)), 1))","v":"男"},null,3]
[null,null,null,null,null,null,null,null,null,null,null,null,null,null,null,null,null,null,null,null,null,"記入日",{"$f":"IF($AC$1=\"\",\"\",INDEX($AG$5:$AG$300,MATCH($AC$1,$AA$5:$AA$300,0)))","v":"2025-06-23"},{"$f":"IF($AE$1=\"\",\"\",INDEX($AG$5:$AG$300,MATCH($AE$1,$AA$5:$AA$300,0)))","v":"2025-06-24"},{"$f":"IF($AG$1=\"\",\"\",INDEX($AG$5:$AG$300,MATCH($AG$1,$AA$5:$AA$300,0)))","v":"2025-06-25"},null,{"$f":"IF(AB8=\"\", \"\", AA8+1)","v":""}]
[null,null,null,null,null,null,null,null,null,null,null,null,null,null,null,null,null,null,null,null,null,"記入者",{"$f":"IF($AC$1=\"\",\"\",INDEX($AH$5:$AH$300,MATCH($AC$1,$AA$5:$AA$300,0)))","v":"abc"},{"$f":"IF($AE$1=\"\",\"\",INDEX($AH$5:$AH$300,MATCH($AE$1,$AA$5:$AA$300,0)))","v":"def"},{"$f":"IF($AG$1=\"\",\"\",INDEX($AH$5:$AH$300,MATCH($AG$1,$AA$5:$AA$300,0)))","v":"ghi"},null,{"$f":"IF(AB9=\"\", \"\", AA9+1)","v":""}]
[null,null,null,null,null,null,null,null,null,null,null,null,null,null,null,null,null,null,null,null,null,"記入者種別",{"$f":"IF($AC$1=\"\",\"\",INDEX($AI$5:$AI$300,MATCH($AC$1,$AA$5:$AA$300,0)))","v":"2. 医療機関"},{"$f":"IF($AE$1=\"\",\"\",INDEX($AI$5:$AI$300,MATCH($AE$1,$AA$5:$AA$300,0)))","v":"3. 保育所・幼稚園・こども園・学校"},{"$f":"IF($AG$1=\"\",\"\",INDEX($AI$5:$AI$300,MATCH($AG$1,$AA$5:$AA$300,0)))","v":"1. 自治体"},null,""]
[null,null,null,null,null,null,null,null,null,null,null,null,null,null,null,null,null,null,null,null,null,null,{"$f":"\"（1）\"&W5","v":"（1）xyz"},{"$f":"\"（2）\"&X5","v":"（2）xyz"},{"$f":"\"（3）\"&Y5","v":"（3）xyz"},null,""]
[null,null,null,null,null,null,null,null,null,null,null,null,null,null,null,null,null,null,null,null,null,"家族要因",{"$f":"IF($AC$1=\"\",\"\",ROUND(SUM(LEFT(INDEX($AJ$5:$AJ$300,MATCH($AC$1,$AA$5:$AA$300,0)), 1), LEFT(INDEX($AK$5:$AK$300,MATCH($AC$1,$AA$5:$AA$300,0)), 1), LEFT(INDEX($AL$5:$AL$300,MATCH($AC$1,$AA$5:$AA$300,0)), 1), LEFT(INDEX($AM$5:$AM$300,MATCH($AC$1,$AA$5:$AA$300,0)), 1))/4, 2))","v":3},{"$f":"IF($AE$1=\"\",\"\",ROUND(SUM(LEFT(INDEX($AJ$5:$AJ$300,MATCH($AE$1,$AA$5:$AA$300,0)), 1), LEFT(INDEX($AK$5:$AK$300,MATCH($AE$1,$AA$5:$AA$300,0)), 1), LEFT(INDEX($AL$5:$AL$300,MATCH($AE$1,$AA$5:$AA$300,0)), 1), LEFT(INDEX($AM$5:$AM$300,MATCH($AE$1,$AA$5:$AA$300,0)), 1))/4, 2))","v":1.75},{"$f":"IF($AG$1=\"\",\"\",ROUND(SUM(LEFT(INDEX($AJ$5:$AJ$300,MATCH($AG$1,$AA$5:$AA$300,0)), 1), LEFT(INDEX($AK$5:$AK$300,MATCH($AG$1,$AA$5:$AA$300,0)), 1), LEFT(INDEX($AL$5:$AL$300,MATCH($AG$1,$AA$5:$AA$300,0)), 1), LEFT(INDEX($AM$5:$AM$300,MATCH($AG$1,$AA$5:$AA$300,0)), 1))/4, 2))","v":2.5},null,""]
[null,null,null,null,null,null,null,null,null,null,null,null,null,null,null,null,null,null,null,null,null,"社会資源",{"$f":"IF($AC$1=\"\",\"\",ROUND(SUM(LEFT(INDEX($AN$5:$AN$300,MATCH($AC$1,$AA$5:$AA$300,0)), 1), LEFT(INDEX($AO$5:$AO$300,MATCH($AC$1,$AA$5:$AA$300,0)), 1), LEFT(INDEX($AP$5:$AP$300,MATCH($AC$1,$AA$5:$AA$300,0)), 1), LEFT(INDEX($AQ$5:$AQ$300,MATCH($AC$1,$AA$5:$AA$300,0)), 1), LEFT(INDEX($AR$5:$AR$300,MATCH($AC$1,$AA$5:$AA$300,0)), 1))/5, 2))","v":3},{"$f":"IF($AE$1=\"\",\"\",ROUND(SUM(LEFT(INDEX($AN$5:$AN$300,MATCH($AE$1,$AA$5:$AA$300,0)), 1), LEFT(INDEX($AO$5:$AO$300,MATCH($AE$1,$AA$5:$AA$300,0)), 1), LEFT(INDEX($AP$5:$AP$300,MATCH($AE$1,$AA$5:$AA$300,0)), 1), LEFT(INDEX($AQ$5:$AQ$300,MATCH($AE$1,$AA$5:$AA$300,0)), 1), LEFT(INDEX($AR$5:$AR$300,MATCH($AE$1,$AA$5:$AA$300,0)), 1))/5, 2))","v":2.4},{"$f":"IF($AG$1=\"\",\"\",ROUND(SUM(LEFT(INDEX($AN$5:$AN$300,MATCH($AG$1,$AA$5:$AA$300,0)), 1), LEFT(INDEX($AO$5:$AO$300,MATCH($AG$1,$AA$5:$AA$300,0)), 1), LEFT(INDEX($AP$5:$AP$300,MATCH($AG$1,$AA$5:$AA$300,0)), 1), LEFT(INDEX($AQ$5:$AQ$300,MATCH($AG$1,$AA$5:$AA$300,0)), 1), LEFT(INDEX($AR$5:$AR$300,MATCH($AG$1,$AA$5:$AA$300,0)), 1))/5, 2))","v":1.8},null,{"$f":"IF(AB13=\"\", \"\", AA13+1)","v":""}]
[null,null,null,null,null,null,null,null,null,null,null,null,null,null,null,null,null,null,null,null,null,"こども要因",{"$f":"IF($AC$1=\"\",\"\",ROUND(SUM(LEFT(INDEX($AS$5:$AS$300,MATCH($AC$1,$AA$5:$AA$300,0)), 1), LEFT(INDEX($AT$5:$AT$300,MATCH($AC$1,$AA$5:$AA$300,0)), 1), LEFT(INDEX($AU$5:$AU$300,MATCH($AC$1,$AA$5:$AA$300,0)), 1), LEFT(INDEX($AV$5:$AV$300,MATCH($AC$1,$AA$5:$AA$300,0)), 1), LEFT(INDEX($AW$5:$AW$300,MATCH($AC$1,$AA$5:$AA$300,0)), 1), LEFT(INDEX($AX$5:$AX$300,MATCH($AC$1,$AA$5:$AA$300,0), 1)), LEFT(INDEX($AY$5:$AY$300,MATCH($AC$1,$AA$5:$AA$300,0)), 1), LEFT(INDEX($AZ$5:$AZ$300,MATCH($AC$1,$AA$5:$AA$300,0)), 1), LEFT(INDEX($BA$5:$BA$300,MATCH($AC$1,$AA$5:$AA$300,0)), 1), LEFT(INDEX($BB$5:$BB$300,MATCH($AC$1,$AA$5:$AA$300,0)), 1), LEFT(INDEX($BC$5:$BC$300,MATCH($AC$1,$AA$5:$AA$300,0)), 1), LEFT(INDEX($BD$5:$BD$300,MATCH($AC$1,$AA$5:$AA$300,0)), 1), LEFT(INDEX($BE$5:$BE$300,MATCH($AC$1,$AA$5:$AA$300,0)), 1), LEFT(INDEX($BF$5:$BF$300,MATCH($AC$1,$AA$5:$AA$300,0)), 1),, LEFT(INDEX($BG$5:$BG$300,MATCH($AC$1,$AA$5:$AA$300,0)), 1), LEFT(INDEX($BH$5:$BH$300,MATCH($AC$1,$AA$5:$AA$300,0)), 1), LEFT(INDEX($BI$5:$BI$300,MATCH($AC$1,$AA$5:$AA$300,0)), 1))/17, 2))","v":3.18},{"$f":"IF($AE$1=\"\",\"\",ROUND(SUM(LEFT(INDEX($AS$5:$AS$300,MATCH($AE$1,$AA$5:$AA$300,0)), 1), LEFT(INDEX($AT$5:$AT$300,MATCH($AE$1,$AA$5:$AA$300,0)), 1), LEFT(INDEX($AU$5:$AU$300,MATCH($AE$1,$AA$5:$AA$300,0)), 1), LEFT(INDEX($AV$5:$AV$300,MATCH($AE$1,$AA$5:$AA$300,0)), 1), LEFT(INDEX($AW$5:$AW$300,MATCH($AE$1,$AA$5:$AA$300,0)), 1), LEFT(INDEX($AX$5:$AX$300,MATCH($AE$1,$AA$5:$AA$300,0), 1)), LEFT(INDEX($AY$5:$AY$300,MATCH($AE$1,$AA$5:$AA$300,0)), 1), LEFT(INDEX($AZ$5:$AZ$300,MATCH($AE$1,$AA$5:$AA$300,0)), 1), LEFT(INDEX($BA$5:$BA$300,MATCH($AE$1,$AA$5:$AA$300,0)), 1), LEFT(INDEX($BB$5:$BB$300,MATCH($AE$1,$AA$5:$AA$300,0)), 1), LEFT(INDEX($BC$5:$BC$300,MATCH($AE$1,$AA$5:$AA$300,0)), 1), LEFT(INDEX($BD$5:$BD$300,MATCH($AE$1,$AA$5:$AA$300,0)), 1), LEFT(INDEX($BE$5:$BE$300,MATCH($AE$1,$AA$5:$AA$300,0)), 1), LEFT(INDEX($BF$5:$BF$300,MATCH($AE$1,$AA$5:$AA$300,0)), 1),, LEFT(INDEX($BG$5:$BG$300,MATCH($AE$1,$AA$5:$AA$300,0)), 1), LEFT(INDEX($BH$5:$BH$300,MATCH($AE$1,$AA$5:$AA$300,0)), 1), LEFT(INDEX($BI$5:$BI$300,MATCH($AE$1,$AA$5:$AA$300,0)), 1))/17, 2))","v":3.06},{"$f":"IF($AG$1=\"\",\"\",ROUND(SUM(LEFT(INDEX($AS$5:$AS$300,MATCH($AG$1,$AA$5:$AA$300,0)), 1), LEFT(INDEX($AT$5:$AT$300,MATCH($AG$1,$AA$5:$AA$300,0)), 1), LEFT(INDEX($AU$5:$AU$300,MATCH($AG$1,$AA$5:$AA$300,0)), 1), LEFT(INDEX($AV$5:$AV$300,MATCH($AG$1,$AA$5:$AA$300,0)), 1), LEFT(INDEX($AW$5:$AW$300,MATCH($AG$1,$AA$5:$AA$300,0)), 1), LEFT(INDEX($AX$5:$AX$300,MATCH($AG$1,$AA$5:$AA$300,0), 1)), LEFT(INDEX($AY$5:$AY$300,MATCH($AG$1,$AA$5:$AA$300,0)), 1), LEFT(INDEX($AZ$5:$AZ$300,MATCH($AG$1,$AA$5:$AA$300,0)), 1), LEFT(INDEX($BA$5:$BA$300,MATCH($AG$1,$AA$5:$AA$300,0)), 1), LEFT(INDEX($BB$5:$BB$300,MATCH($AG$1,$AA$5:$AA$300,0)), 1), LEFT(INDEX($BC$5:$BC$300,MATCH($AG$1,$AA$5:$AA$300,0)), 1), LEFT(INDEX($BD$5:$BD$300,MATCH($AG$1,$AA$5:$AA$300,0)), 1), LEFT(INDEX($BE$5:$BE$300,MATCH($AG$1,$AA$5:$AA$300,0)), 1), LEFT(INDEX($BF$5:$BF$300,MATCH($AG$1,$AA$5:$AA$300,0)), 1),, LEFT(INDEX($BG$5:$BG$300,MATCH($AG$1,$AA$5:$AA$300,0)), 1), LEFT(INDEX($BH$5:$BH$300,MATCH($AG$1,$AA$5:$AA$300,0)), 1), LEFT(INDEX($BI$5:$BI$300,MATCH($AG$1,$AA$5:$AA$300,0)), 1))/17, 2))","v":2.88},null,""]
[null,null,null,null,null,null,null,null,null,null,null,null,null,null,null,null,null,null,null,null,null,"家庭の暮らし向き",{"$f":"IF($AC$1=\"\",\"\",LEFT(INDEX($AJ$5:$AJ$300,MATCH($AC$1,$AA$5:$AA$300,0)),1)*1)","v":3},{"$f":"IF($AE$1=\"\",\"\",LEFT(INDEX($AJ$5:$AJ$300,MATCH($AE$1,$AA$5:$AA$300,0)),1)*1)","v":2},{"$f":"IF($AG$1=\"\",\"\",LEFT(INDEX($AJ$5:$AJ$300,MATCH($AG$1,$AA$5:$AA$300,0)),1)*1)","v":2},null,""]
[null,null,null,null,null,null,null,null,null,null,null,null,null,null,null,null,null,null,null,null,null,"保護者のメンタルヘルス",{"$f":"IF($AC$1=\"\",\"\",LEFT(INDEX($AK$5:$AK$300,MATCH($AC$1,$AA$5:$AA$300,0)),1)*1)","v":1},{"$f":"IF($AE$1=\"\",\"\",LEFT(INDEX($AK$5:$AK$300,MATCH($AE$1,$AA$5:$AA$300,0)),1)*1)","v":1},{"$f":"IF($AG$1=\"\",\"\",LEFT(INDEX($AK$5:$AK$300,MATCH($AG$1,$AA$5:$AA$300,0)),1)*1)","v":3},null,""]
[null,null,null,null,null,null,null,null,null,null,null,null,null,null,null,null,null,null,null,null,null,"養育の困難感",{"$f":"IF($AC$1=\"\",\"\",LEFT(INDEX($AL$5:$AL$300,MATCH($AC$1,$AA$5:$AA$300,0)),1)*1)","v":5},{"$f":"IF($AE$1=\"\",\"\",LEFT(INDEX($AL$5:$AL$300,MATCH($AE$1,$AA$5:$AA$300,0)),1)*1)","v":2},{"$f":"IF($AG$1=\"\",\"\",LEFT(INDEX($AL$5:$AL$300,MATCH($AG$1,$AA$5:$AA$300,0)),1)*1)","v":3},null,""]
[null,null,null,null,null,null,null,null,null,null,null,null,null,null,null,null,null,null,null,null,null,"家族・親族のサポート",{"$f":"IF($AC$1=\"\",\"\",LEFT(INDEX($AM$5:$AM$300,MATCH($AC$1,$AA$5:$AA$300,0)),1)*1)","v":3},{"$f":"IF($AE$1=\"\",\"\",LEFT(INDEX($AM$5:$AM$300,MATCH($AE$1,$AA$5:$AA$300,0)),1)*1)","v":2},{"$f":"IF($AG$1=\"\",\"\",LEFT(INDEX($AM$5:$AM$300,MATCH($AG$1,$AA$5:$AA$300,0)),1)*1)","v":2},null,""]
[null,null,null,null,null,null,null,null,null,null,null,null,null,null,null,null,null,null,null,null,null,"自治体の保険領域でのサポート",{"$f":"IF($AC$1=\"\",\"\",LEFT(INDEX($AN$5:$AN$300,MATCH($AC$1,$AA$5:$AA$300,0)),1)*1)","v":3},{"$f":"IF($AE$1=\"\",\"\",LEFT(INDEX($AN$5:$AN$300,MATCH($AE$1,$AA$5:$AA$300,0)),1)*1)","v":2},{"$f":"IF($AG$1=\"\",\"\",LEFT(INDEX($AN$5:$AN$300,MATCH($AG$1,$AA$5:$AA$300,0)),1)*1)","v":1}]
[null,null,null,null,null,null,null,null,null,null,null,null,null,null,null,null,null,null,null,null,null,"園や学校でのサポート",{"$f":"IF($AC$1=\"\",\"\",LEFT(INDEX($AO$5:$AO$300,MATCH($AC$1,$AA$5:$AA$300,0)),1)*1)","v":3},{"$f":"IF($AE$1=\"\",\"\",LEFT(INDEX($AO$5:$AO$300,MATCH($AE$1,$AA$5:$AA$300,0)),1)*1)","v":1},{"$f":"IF($AG$1=\"\",\"\",LEFT(INDEX($AO$5:$AO$300,MATCH($AG$1,$AA$5:$AA$300,0)),1)*1)","v":1}]
[null,null,null,null,null,null,null,null,null,null,null,null,null,null,null,null,null,null,null,null,null,"利用可能な地域の福祉サービス資源",{"$f":"IF($AC$1=\"\",\"\",LEFT(INDEX($AP$5:$AP$300,MATCH($AC$1,$AA$5:$AA$300,0)),1)*1)","v":3},{"$f":"IF($AE$1=\"\",\"\",LEFT(INDEX($AP$5:$AP$300,MATCH($AE$1,$AA$5:$AA$300,0)),1)*1)","v":3},{"$f":"IF($AG$1=\"\",\"\",LEFT(INDEX($AP$5:$AP$300,MATCH($AG$1,$AA$5:$AA$300,0)),1)*1)","v":2}]
[null,null,null,null,null,null,null,null,null,null,null,null,null,null,null,null,null,null,null,null,null,"福祉・療育機関でのサポート",{"$f":"IF($AC$1=\"\",\"\",LEFT(INDEX($AQ$5:$AQ$300,MATCH($AC$1,$AA$5:$AA$300,0)),1)*1)","v":3},{"$f":"IF($AE$1=\"\",\"\",LEFT(INDEX($AQ$5:$AQ$300,MATCH($AE$1,$AA$5:$AA$300,0)),1)*1)","v":3},{"$f":"IF($AG$1=\"\",\"\",LEFT(INDEX($AQ$5:$AQ$300,MATCH($AG$1,$AA$5:$AA$300,0)),1)*1)","v":2}]
[null,null,null,null,null,null,null,null,null,null,null,null,null,null,null,null,null,null,null,null,null,"医療機関でのサポート",{"$f":"IF($AC$1=\"\",\"\",LEFT(INDEX($AR$5:$AR$300,MATCH($AC$1,$AA$5:$AA$300,0)),1)*1)","v":3},{"$f":"IF($AE$1=\"\",\"\",LEFT(INDEX($AR$5:$AR$300,MATCH($AE$1,$AA$5:$AA$300,0)),1)*1)","v":3},{"$f":"IF($AG$1=\"\",\"\",LEFT(INDEX($AR$5:$AR$300,MATCH($AG$1,$AA$5:$AA$300,0)),1)*1)","v":3}]
[null,null,null,null,null,null,null,null,null,null,null,null,null,null,null,null,null,null,null,null,null,"登園・登校状況",{"$f":"IF($AC$1=\"\",\"\",LEFT(INDEX($AS$5:$AS$300,MATCH($AC$1,$AA$5:$AA$300,0)),1)*1)","v":1},{"$f":"IF($AE$1=\"\",\"\",LEFT(INDEX($AS$5:$AS$300,MATCH($AE$1,$AA$5:$AA$300,0)),1)*1)","v":4},{"$f":"IF($AG$1=\"\",\"\",LEFT(INDEX($AS$5:$AS$300,MATCH($AG$1,$AA$5:$AA$300,0)),1)*1)","v":3}]
[null,null,null,null,null,null,null,null,null,null,null,null,null,null,null,null,null,null,null,null,null,"知的水準・学校の成績",{"$f":"IF($AC$1=\"\",\"\",LEFT(INDEX($AT$5:$AT$300,MATCH($AC$1,$AA$5:$AA$300,0)),1)*1)","v":4},{"$f":"IF($AE$1=\"\",\"\",LEFT(INDEX($AT$5:$AT$300,MATCH($AE$1,$AA$5:$AA$300,0)),1)*1)","v":4},{"$f":"IF($AG$1=\"\",\"\",LEFT(INDEX($AT$5:$AT$300,MATCH($AG$1,$AA$5:$AA$300,0)),1)*1)","v":3}]
[null,null,null,null,null,null,null,null,null,null,null,null,null,null,null,null,null,null,null,null,null,"対人関係",{"$f":"IF($AC$1=\"\",\"\",LEFT(INDEX($AU$5:$AU$300,MATCH($AC$1,$AA$5:$AA$300,0)),1)*1)","v":3},{"$f":"IF($AE$1=\"\",\"\",LEFT(INDEX($AU$5:$AU$300,MATCH($AE$1,$AA$5:$AA$300,0)),1)*1)","v":2},{"$f":"IF($AG$1=\"\",\"\",LEFT(INDEX($AU$5:$AU$300,MATCH($AG$1,$AA$5:$AA$300,0)),1)*1)","v":2}]
[null,null,null,null,null,null,null,null,null,null,null,null,null,null,null,null,null,null,null,null,null,"コミュニケーション",{"$f":"IF($AC$1=\"\",\"\",LEFT(INDEX($AV$5:$AV$300,MATCH($AC$1,$AA$5:$AA$300,0)),1)*1)","v":1},{"$f":"IF($AE$1=\"\",\"\",LEFT(INDEX($AV$5:$AV$300,MATCH($AE$1,$AA$5:$AA$300,0)),1)*1)","v":3},{"$f":"IF($AG$1=\"\",\"\",LEFT(INDEX($AV$5:$AV$300,MATCH($AG$1,$AA$5:$AA$300,0)),1)*1)","v":3}]
[null,null,null,null,null,null,null,null,null,null,null,null,null,null,null,null,null,null,null,null,null,"こだわり",{"$f":"IF($AC$1=\"\",\"\",LEFT(INDEX($AW$5:$AW$300,MATCH($AC$1,$AA$5:$AA$300,0)),1)*1)","v":5},{"$f":"IF($AE$1=\"\",\"\",LEFT(INDEX($AW$5:$AW$300,MATCH($AE$1,$AA$5:$AA$300,0)),1)*1)","v":4},{"$f":"IF($AG$1=\"\",\"\",LEFT(INDEX($AW$5:$AW$300,MATCH($AG$1,$AA$5:$AA$300,0)),1)*1)","v":4}]
[null,null,null,null,null,null,null,null,null,null,null,null,null,null,null,null,null,null,null,null,null,"多動・衝動性",{"$f":"IF($AC$1=\"\",\"\",LEFT(INDEX($AX$5:$AX$300,MATCH($AC$1,$AA$5:$AA$300,0)),1)*1)","v":5},{"$f":"IF($AE$1=\"\",\"\",LEFT(INDEX($AX$5:$AX$300,MATCH($AE$1,$AA$5:$AA$300,0)),1)*1)","v":3},{"$f":"IF($AG$1=\"\",\"\",LEFT(INDEX($AX$5:$AX$300,MATCH($AG$1,$AA$5:$AA$300,0)),1)*1)","v":4}]
[null,null,null,null,null,null,null,null,null,null,null,null,null,null,null,null,null,null,null,null,null,"注意・集中力",{"$f":"IF($AC$1=\"\",\"\",LEFT(INDEX($AY$5:$AY$300,MATCH($AC$1,$AA$5:$AA$300,0)),1)*1)","v":5},{"$f":"IF($AE$1=\"\",\"\",LEFT(INDEX($AY$5:$AY$300,MATCH($AE$1,$AA$5:$AA$300,0)),1)*1)","v":4},{"$f":"IF($AG$1=\"\",\"\",LEFT(INDEX($AY$5:$AY$300,MATCH($AG$1,$AA$5:$AA$300,0)),1)*1)","v":4}]
[null,null,null,null,null,null,null,null,null,null,null,null,null,null,null,null,null,null,null,null,null,"感覚の問題",{"$f":"IF($AC$1=\"\",\"\",LEFT(INDEX($AZ$5:$AZ$300,MATCH($AC$1,$AA$5:$AA$300,0)),1)*1)","v":3},{"$f":"IF($AE$1=\"\",\"\",LEFT(INDEX($AZ$5:$AZ$300,MATCH($AE$1,$AA$5:$AA$300,0)),1)*1)","v":3},{"$f":"IF($AG$1=\"\",\"\",LEFT(INDEX($AZ$5:$AZ$300,MATCH($AG$1,$AA$5:$AA$300,0)),1)*1)","v":3}]
[{"$f":"\"【具体例】\"&CHAR(10)&IF($AC$1=\"\", \"\", IF(COUNTBLANK($W$43:$W$69)=27, W12&\"　特記事項なし\", W12&\"　\"&W70))&CHAR(10)&IF($AE$1=\"\", \"\", IF(COUNTBLANK($X$43:$X$69)=27, X12&\"　特記事項なし\", X12&\"　\"&X70))&CHAR(10)&IF($AG$1=\"\", \"\", IF(COUNTBLANK($Y$43:$Y$69)=27, Y12&\"　特記事項なし\", Y12&\"　\"&Y70))","v":"【具体例】\n（1）xyz　特記事項なし\n（2）xyz　●登園・登校状況：毎週月曜日は登校を渋る●知的水準・学校の成績：一部の強化についていけない●その他：早急な対応は必要ないが，今後が心配\n（3）xyz　特記事項なし"},null,null,null,null,null,null,null,null,null,null,null,null,null,null,null,null,null,null,null,null,"読み書き",{"$f":"IF($AC$1=\"\",\"\",LEFT(INDEX($BA$5:$BA$300,MATCH($AC$1,$AA$5:$AA$300,0)),1)*1)","v":3},{"$f":"IF($AE$1=\"\",\"\",LEFT(INDEX($BA$5:$BA$300,MATCH($AE$1,$AA$5:$AA$300,0)),1)*1)","v":4},{"$f":"IF($AG$1=\"\",\"\",LEFT(INDEX($BA$5:$BA$300,MATCH($AG$1,$AA$5:$AA$300,0)),1)*1)","v":3}]
[null,null,null,null,null,null,null,null,null,null,null,null,null,null,null,null,null,null,null,null,null,"運動・不器用",{"$f":"IF($AC$1=\"\",\"\",LEFT(INDEX($BB$5:$BB$300,MATCH($AC$1,$AA$5:$AA$300,0)),1)*1)","v":3},{"$f":"IF($AE$1=\"\",\"\",LEFT(INDEX($BB$5:$BB$300,MATCH($AE$1,$AA$5:$AA$300,0)),1)*1)","v":3},{"$f":"IF($AG$1=\"\",\"\",LEFT(INDEX($BB$5:$BB$300,MATCH($AG$1,$AA$5:$AA$300,0)),1)*1)","v":2}]
[null,null,null,null,null,null,null,null,null,null,null,null,null,null,null,null,null,null,null,null,null,"身辺自立",{"$f":"IF($AC$1=\"\",\"\",LEFT(INDEX($BC$5:$BC$300,MATCH($AC$1,$AA$5:$AA$300,0)),1)*1)","v":1},{"$f":"IF($AE$1=\"\",\"\",LEFT(INDEX($BC$5:$BC$300,MATCH($AE$1,$AA$5:$AA$300,0)),1)*1)","v":3},{"$f":"IF($AG$1=\"\",\"\",LEFT(INDEX($BC$5:$BC$300,MATCH($AG$1,$AA$5:$AA$300,0)),1)*1)","v":3}]
[null,null,null,null,null,null,null,null,null,null,null,null,null,null,null,null,null,null,null,null,null,"睡眠",{"$f":"IF($AC$1=\"\",\"\",LEFT(INDEX($BD$5:$BD$300,MATCH($AC$1,$AA$5:$AA$300,0)),1)*1)","v":1},{"$f":"IF($AE$1=\"\",\"\",LEFT(INDEX($BD$5:$BD$300,MATCH($AE$1,$AA$5:$AA$300,0)),1)*1)","v":2},{"$f":"IF($AG$1=\"\",\"\",LEFT(INDEX($BD$5:$BD$300,MATCH($AG$1,$AA$5:$AA$300,0)),1)*1)","v":2}]
[null,null,null,null,null,null,null,null,null,null,null,null,null,null,null,null,null,null,null,null,null,"不安・緘黙",{"$f":"IF($AC$1=\"\",\"\",LEFT(INDEX($BE$5:$BE$300,MATCH($AC$1,$AA$5:$AA$300,0)),1)*1)","v":1},{"$f":"IF($AE$1=\"\",\"\",LEFT(INDEX($BE$5:$BE$300,MATCH($AE$1,$AA$5:$AA$300,0)),1)*1)","v":2},{"$f":"IF($AG$1=\"\",\"\",LEFT(INDEX($BE$5:$BE$300,MATCH($AG$1,$AA$5:$AA$300,0)),1)*1)","v":2}]
[null,null,null,null,null,null,null,null,null,null,null,null,null,null,null,null,null,null,null,null,null,"自傷・他害行動",{"$f":"IF($AC$1=\"\",\"\",LEFT(INDEX($BF$5:$BF$300,MATCH($AC$1,$AA$5:$AA$300,0)),1)*1)","v":5},{"$f":"IF($AE$1=\"\",\"\",LEFT(INDEX($BF$5:$BF$300,MATCH($AE$1,$AA$5:$AA$300,0)),1)*1)","v":3},{"$f":"IF($AG$1=\"\",\"\",LEFT(INDEX($BF$5:$BF$300,MATCH($AG$1,$AA$5:$AA$300,0)),1)*1)","v":3}]
[null,null,null,null,null,null,null,null,null,null,null,null,null,null,null,null,null,null,null,null,null,"いじめの被害",{"$f":"IF($AC$1=\"\",\"\",LEFT(INDEX($BG$5:$BG$300,MATCH($AC$1,$AA$5:$AA$300,0)),1)*1)","v":5},{"$f":"IF($AE$1=\"\",\"\",LEFT(INDEX($BG$5:$BG$300,MATCH($AE$1,$AA$5:$AA$300,0)),1)*1)","v":3},{"$f":"IF($AG$1=\"\",\"\",LEFT(INDEX($BG$5:$BG$300,MATCH($AG$1,$AA$5:$AA$300,0)),1)*1)","v":3}]
[null,null,null,null,null,null,null,null,null,null,null,null,null,null,null,null,null,null,null,null,null,"身体状態（病弱）",{"$f":"IF($AC$1=\"\",\"\",LEFT(INDEX($BH$5:$BH$300,MATCH($AC$1,$AA$5:$AA$300,0)),1)*1)","v":3},{"$f":"IF($AE$1=\"\",\"\",LEFT(INDEX($BH$5:$BH$300,MATCH($AE$1,$AA$5:$AA$300,0)),1)*1)","v":2},{"$f":"IF($AG$1=\"\",\"\",LEFT(INDEX($BH$5:$BH$300,MATCH($AG$1,$AA$5:$AA$300,0)),1)*1)","v":2}]
[null,null,null,null,null,null,null,null,null,null,null,null,null,null,null,null,null,null,null,null,null,"服薬状況",{"$f":"IF($AC$1=\"\",\"\",LEFT(INDEX($BI$5:$BI$300,MATCH($AC$1,$AA$5:$AA$300,0)),1)*1)","v":5},{"$f":"IF($AE$1=\"\",\"\",LEFT(INDEX($BI$5:$BI$300,MATCH($AE$1,$AA$5:$AA$300,0)),1)*1)","v":3},{"$f":"IF($AG$1=\"\",\"\",LEFT(INDEX($BI$5:$BI$300,MATCH($AG$1,$AA$5:$AA$300,0)),1)*1)","v":3}]
[null,null,null,null,null,null,null,null,null,null,null,null,null,null,null,null,null,null,null,null,null,"その他"]
[null,null,null,null,null,null,null,null,null,null,null,null,null,null,null,null,null,null,null,null,null,"●家庭の暮らし向き：",{"$f":"IF($AC$1=\"\",\"\", IF(INDEX($BK$5:$BK$300,MATCH($AC$1,$AA$5:$AA$300,0))=0, \"\", INDEX($BK$5:$BK$300,MATCH($AC$1,$AA$5:$AA$300,0))))","v":""},{"$f":"IF($AE$1=\"\",\"\", IF(INDEX($BK$5:$BK$300,MATCH($AE$1,$AA$5:$AA$300,0))=0, \"\", INDEX($BK$5:$BK$300,MATCH($AE$1,$AA$5:$AA$300,0))))","v":""},{"$f":"IF($AG$1=\"\",\"\", IF(INDEX($BK$5:$BK$300,MATCH($AG$1,$AA$5:$AA$300,0))=0, \"\", INDEX($BK$5:$BK$300,MATCH($AG$1,$AA$5:$AA$300,0))))","v":""}]
[null,null,null,null,null,null,null,null,null,null,null,null,null,null,null,null,null,null,null,null,null,"●保護者のメンタルヘルス：",{"$f":"IF($AC$1=\"\",\"\", IF(INDEX($BL$5:$BL$300,MATCH($AC$1,$AA$5:$AA$300,0))=0, \"\", INDEX($BL$5:$BL$300,MATCH($AC$1,$AA$5:$AA$300,0))))","v":""},{"$f":"IF($AE$1=\"\",\"\", IF(INDEX($BL$5:$BL$300,MATCH($AE$1,$AA$5:$AA$300,0))=0, \"\", INDEX($BL$5:$BL$300,MATCH($AE$1,$AA$5:$AA$300,0))))","v":""},{"$f":"IF($AG$1=\"\",\"\", IF(INDEX($BL$5:$BL$300,MATCH($AG$1,$AA$5:$AA$300,0))=0, \"\", INDEX($BL$5:$BL$300,MATCH($AG$1,$AA$5:$AA$300,0))))","v":""}]
[null,null,null,null,null,null,null,null,null,null,null,null,null,null,null,null,null,null,null,null,null,"●養育の困難感：",{"$f":"IF($AC$1=\"\",\"\", IF(INDEX($BM$5:$BM$300,MATCH($AC$1,$AA$5:$AA$300,0))=0, \"\", INDEX($BM$5:$BM$300,MATCH($AC$1,$AA$5:$AA$300,0))))","v":""},{"$f":"IF($AE$1=\"\",\"\", IF(INDEX($BM$5:$BM$300,MATCH($AE$1,$AA$5:$AA$300,0))=0, \"\", INDEX($BM$5:$BM$300,MATCH($AE$1,$AA$5:$AA$300,0))))","v":""},{"$f":"IF($AG$1=\"\",\"\", IF(INDEX($BM$5:$BM$300,MATCH($AG$1,$AA$5:$AA$300,0))=0, \"\", INDEX($BM$5:$BM$300,MATCH($AG$1,$AA$5:$AA$300,0))))","v":""}]
[null,null,null,null,null,null,null,null,null,null,null,null,null,null,null,null,null,null,null,null,null,"●家族・親族のサポート：",{"$f":"IF($AC$1=\"\",\"\", IF(INDEX($BN$5:$BN$300,MATCH($AC$1,$AA$5:$AA$300,0))=0, \"\", INDEX($BN$5:$BN$300,MATCH($AC$1,$AA$5:$AA$300,0))))","v":""},{"$f":"IF($AE$1=\"\",\"\", IF(INDEX($BN$5:$BN$300,MATCH($AE$1,$AA$5:$AA$300,0))=0, \"\", INDEX($BN$5:$BN$300,MATCH($AE$1,$AA$5:$AA$300,0))))","v":""},{"$f":"IF($AG$1=\"\",\"\", IF(INDEX($BN$5:$BN$300,MATCH($AG$1,$AA$5:$AA$300,0))=0, \"\", INDEX($BN$5:$BN$300,MATCH($AG$1,$AA$5:$AA$300,0))))","v":""}]
[null,null,null,null,null,null,null,null,null,null,null,null,null,null,null,null,null,null,null,null,null,"●自治体の保険領域でのサポート：",{"$f":"IF($AC$1=\"\",\"\", IF(INDEX($BO$5:$BO$300,MATCH($AC$1,$AA$5:$AA$300,0))=0, \"\", INDEX($BO$5:$BO$300,MATCH($AC$1,$AA$5:$AA$300,0))))","v":""},{"$f":"IF($AE$1=\"\",\"\", IF(INDEX($BO$5:$BO$300,MATCH($AE$1,$AA$5:$AA$300,0))=0, \"\", INDEX($BO$5:$BO$300,MATCH($AE$1,$AA$5:$AA$300,0))))","v":""},{"$f":"IF($AG$1=\"\",\"\", IF(INDEX($BO$5:$BO$300,MATCH($AG$1,$AA$5:$AA$300,0))=0, \"\", INDEX($BO$5:$BO$300,MATCH($AG$1,$AA$5:$AA$300,0))))","v":""}]
[null,null,null,null,null,null,null,null,null,null,null,null,null,null,null,null,null,null,null,null,null,"●園や学校でのサポート：",{"$f":"IF($AC$1=\"\",\"\", IF(INDEX($BP$5:$BP$300,MATCH($AC$1,$AA$5:$AA$300,0))=0, \"\", INDEX($BP$5:$BP$300,MATCH($AC$1,$AA$5:$AA$300,0))))","v":""},{"$f":"IF($AE$1=\"\",\"\", IF(INDEX($BP$5:$BP$300,MATCH($AE$1,$AA$5:$AA$300,0))=0, \"\", INDEX($BP$5:$BP$300,MATCH($AE$1,$AA$5:$AA$300,0))))","v":""},{"$f":"IF($AG$1=\"\",\"\", IF(INDEX($BP$5:$BP$300,MATCH($AG$1,$AA$5:$AA$300,0))=0, \"\", INDEX($BP$5:$BP$300,MATCH($AG$1,$AA$5:$AA$300,0))))","v":""}]
[null,null,null,null,null,null,null,null,null,null,null,null,null,null,null,null,null,null,null,null,null,"●利用可能な地域の福祉サービス資源：",{"$f":"IF($AC$1=\"\",\"\", IF(INDEX($BQ$5:$BQ$300,MATCH($AC$1,$AA$5:$AA$300,0))=0, \"\", INDEX($BQ$5:$BQ$300,MATCH($AC$1,$AA$5:$AA$300,0))))","v":""},{"$f":"IF($AE$1=\"\",\"\", IF(INDEX($BQ$5:$BQ$300,MATCH($AE$1,$AA$5:$AA$300,0))=0, \"\", INDEX($BQ$5:$BQ$300,MATCH($AE$1,$AA$5:$AA$300,0))))","v":""},{"$f":"IF($AG$1=\"\",\"\", IF(INDEX($BQ$5:$BQ$300,MATCH($AG$1,$AA$5:$AA$300,0))=0, \"\", INDEX($BQ$5:$BQ$300,MATCH($AG$1,$AA$5:$AA$300,0))))","v":""}]
[null,null,null,null,null,null,null,null,null,null,null,null,null,null,null,null,null,null,null,null,null,"●福祉・療育機関でのサポート：",{"$f":"IF($AC$1=\"\",\"\", IF(INDEX($BR$5:$BR$300,MATCH($AC$1,$AA$5:$AA$300,0))=0, \"\", INDEX($BR$5:$BR$300,MATCH($AC$1,$AA$5:$AA$300,0))))","v":""},{"$f":"IF($AE$1=\"\",\"\", IF(INDEX($BR$5:$BR$300,MATCH($AE$1,$AA$5:$AA$300,0))=0, \"\", INDEX($BR$5:$BR$300,MATCH($AE$1,$AA$5:$AA$300,0))))","v":""},{"$f":"IF($AG$1=\"\",\"\", IF(INDEX($BR$5:$BR$300,MATCH($AG$1,$AA$5:$AA$300,0))=0, \"\", INDEX($BR$5:$BR$300,MATCH($AG$1,$AA$5:$AA$300,0))))","v":""}]
[null,null,null,null,null,null,null,null,null,null,null,null,null,null,null,null,null,null,null,null,null,"●医療機関でのサポート：",{"$f":"IF($AC$1=\"\",\"\", IF(INDEX($BS$5:$BS$300,MATCH($AC$1,$AA$5:$AA$300,0))=0, \"\", INDEX($BS$5:$BS$300,MATCH($AC$1,$AA$5:$AA$300,0))))","v":""},{"$f":"IF($AE$1=\"\",\"\", IF(INDEX($BS$5:$BS$300,MATCH($AE$1,$AA$5:$AA$300,0))=0, \"\", INDEX($BS$5:$BS$300,MATCH($AE$1,$AA$5:$AA$300,0))))","v":""},{"$f":"IF($AG$1=\"\",\"\", IF(INDEX($BS$5:$BS$300,MATCH($AG$1,$AA$5:$AA$300,0))=0, \"\", INDEX($BS$5:$BS$300,MATCH($AG$1,$AA$5:$AA$300,0))))","v":""}]
[null,null,null,null,null,null,null,null,null,null,null,null,null,null,null,null,null,null,null,null,null,"●登園・登校状況：",{"$f":"IF($AC$1=\"\",\"\", IF(INDEX($BT$5:$BT$300,MATCH($AC$1,$AA$5:$AA$300,0))=0, \"\", INDEX($BT$5:$BT$300,MATCH($AC$1,$AA$5:$AA$300,0))))","v":""},{"$f":"IF($AE$1=\"\",\"\", IF(INDEX($BT$5:$BT$300,MATCH($AE$1,$AA$5:$AA$300,0))=0, \"\", INDEX($BT$5:$BT$300,MATCH($AE$1,$AA$5:$AA$300,0))))","v":"毎週月曜日は登校を渋る"},{"$f":"IF($AG$1=\"\",\"\", IF(INDEX($BT$5:$BT$300,MATCH($AG$1,$AA$5:$AA$300,0))=0, \"\", INDEX($BT$5:$BT$300,MATCH($AG$1,$AA$5:$AA$300,0))))","v":""}]
[null,null,null,null,null,null,null,null,null,null,null,null,null,null,null,null,null,null,null,null,null,"●知的水準・学校の成績：",{"$f":"IF($AC$1=\"\",\"\", IF(INDEX($BU$5:$BU$300,MATCH($AC$1,$AA$5:$AA$300,0))=0, \"\", INDEX($BU$5:$BU$300,MATCH($AC$1,$AA$5:$AA$300,0))))","v":""},{"$f":"IF($AE$1=\"\",\"\", IF(INDEX($BU$5:$BU$300,MATCH($AE$1,$AA$5:$AA$300,0))=0, \"\", INDEX($BU$5:$BU$300,MATCH($AE$1,$AA$5:$AA$300,0))))","v":"一部の強化についていけない"},{"$f":"IF($AG$1=\"\",\"\", IF(INDEX($BU$5:$BU$300,MATCH($AG$1,$AA$5:$AA$300,0))=0, \"\", INDEX($BU$5:$BU$300,MATCH($AG$1,$AA$5:$AA$300,0))))","v":""}]
[null,null,null,null,null,null,null,null,null,null,null,null,null,null,null,null,null,null,null,null,null,"●対人関係：",{"$f":"IF($AC$1=\"\",\"\", IF(INDEX($BV$5:$BV$300,MATCH($AC$1,$AA$5:$AA$300,0))=0, \"\", INDEX($BV$5:$BV$300,MATCH($AC$1,$AA$5:$AA$300,0))))","v":""},{"$f":"IF($AE$1=\"\",\"\", IF(INDEX($BV$5:$BV$300,MATCH($AE$1,$AA$5:$AA$300,0))=0, \"\", INDEX($BV$5:$BV$300,MATCH($AE$1,$AA$5:$AA$300,0))))","v":""},{"$f":"IF($AG$1=\"\",\"\", IF(INDEX($BV$5:$BV$300,MATCH($AG$1,$AA$5:$AA$300,0))=0, \"\", INDEX($BV$5:$BV$300,MATCH($AG$1,$AA$5:$AA$300,0))))","v":""}]
[null,null,null,null,null,null,null,null,null,null,null,null,null,null,null,null,null,null,null,null,null,"●コミュニケーション：",{"$f":"IF($AC$1=\"\",\"\", IF(INDEX($BW$5:$BW$300,MATCH($AC$1,$AA$5:$AA$300,0))=0, \"\", INDEX($BW$5:$BW$300,MATCH($AC$1,$AA$5:$AA$300,0))))","v":""},{"$f":"IF($AE$1=\"\",\"\", IF(INDEX($BW$5:$BW$300,MATCH($AE$1,$AA$5:$AA$300,0))=0, \"\", INDEX($BW$5:$BW$300,MATCH($AE$1,$AA$5:$AA$300,0))))","v":""},{"$f":"IF($AG$1=\"\",\"\", IF(INDEX($BW$5:$BW$300,MATCH($AG$1,$AA$5:$AA$300,0))=0, \"\", INDEX($BW$5:$BW$300,MATCH($AG$1,$AA$5:$AA$300,0))))","v":""}]
[null,null,null,null,null,null,null,null,null,null,null,null,null,null,null,null,null,null,null,null,null,"●こだわり：",{"$f":"IF($AC$1=\"\",\"\", IF(INDEX($BX$5:$BX$300,MATCH($AC$1,$AA$5:$AA$300,0))=0, \"\", INDEX($BX$5:$BX$300,MATCH($AC$1,$AA$5:$AA$300,0))))","v":""},{"$f":"IF($AE$1=\"\",\"\", IF(INDEX($BX$5:$BX$300,MATCH($AE$1,$AA$5:$AA$300,0))=0, \"\", INDEX($BX$5:$BX$300,MATCH($AE$1,$AA$5:$AA$300,0))))","v":""},{"$f":"IF($AG$1=\"\",\"\", IF(INDEX($BX$5:$BX$300,MATCH($AG$1,$AA$5:$AA$300,0))=0, \"\", INDEX($BX$5:$BX$300,MATCH($AG$1,$AA$5:$AA$300,0))))","v":""}]
[null,null,null,null,null,null,null,null,null,null,null,null,null,null,null,null,null,null,null,null,null,"●多動・衝動性：",{"$f":"IF($AC$1=\"\",\"\", IF(INDEX($BY$5:$BY$300,MATCH($AC$1,$AA$5:$AA$300,0))=0, \"\", INDEX($BY$5:$BY$300,MATCH($AC$1,$AA$5:$AA$300,0))))","v":""},{"$f":"IF($AE$1=\"\",\"\", IF(INDEX($BY$5:$BY$300,MATCH($AE$1,$AA$5:$AA$300,0))=0, \"\", INDEX($BY$5:$BY$300,MATCH($AE$1,$AA$5:$AA$300,0))))","v":""},{"$f":"IF($AG$1=\"\",\"\", IF(INDEX($BY$5:$BY$300,MATCH($AG$1,$AA$5:$AA$300,0))=0, \"\", INDEX($BY$5:$BY$300,MATCH($AG$1,$AA$5:$AA$300,0))))","v":""}]
[null,null,null,null,null,null,null,null,null,null,null,null,null,null,null,null,null,null,null,null,null,"●注意・集中力：",{"$f":"IF($AC$1=\"\",\"\", IF(INDEX($BZ$5:$BZ$300,MATCH($AC$1,$AA$5:$AA$300,0))=0, \"\", INDEX($BZ$5:$BZ$300,MATCH($AC$1,$AA$5:$AA$300,0))))","v":""},{"$f":"IF($AE$1=\"\",\"\", IF(INDEX($BZ$5:$BZ$300,MATCH($AE$1,$AA$5:$AA$300,0))=0, \"\", INDEX($BZ$5:$BZ$300,MATCH($AE$1,$AA$5:$AA$300,0))))","v":""},{"$f":"IF($AG$1=\"\",\"\", IF(INDEX($BZ$5:$BZ$300,MATCH($AG$1,$AA$5:$AA$300,0))=0, \"\", INDEX($BZ$5:$BZ$300,MATCH($AG$1,$AA$5:$AA$300,0))))","v":""}]
[null,null,null,null,null,null,null,null,null,null,null,null,null,null,null,null,null,null,null,null,null,"●感覚の問題：",{"$f":"IF($AC$1=\"\",\"\", IF(INDEX($CA$5:$CA$300,MATCH($AC$1,$AA$5:$AA$300,0))=0, \"\", INDEX($CA$5:$CA$300,MATCH($AC$1,$AA$5:$AA$300,0))))","v":""},{"$f":"IF($AE$1=\"\",\"\", IF(INDEX($CA$5:$CA$300,MATCH($AE$1,$AA$5:$AA$300,0))=0, \"\", INDEX($CA$5:$CA$300,MATCH($AE$1,$AA$5:$AA$300,0))))","v":""},{"$f":"IF($AG$1=\"\",\"\", IF(INDEX($CA$5:$CA$300,MATCH($AG$1,$AA$5:$AA$300,0))=0, \"\", INDEX($CA$5:$CA$300,MATCH($AG$1,$AA$5:$AA$300,0))))","v":""}]
[null,null,null,null,null,null,null,null,null,null,null,null,null,null,null,null,null,null,null,null,null,"●読み書き：",{"$f":"IF($AC$1=\"\",\"\", IF(INDEX($CB$5:$CB$300,MATCH($AC$1,$AA$5:$AA$300,0))=0, \"\", INDEX($CB$5:$CB$300,MATCH($AC$1,$AA$5:$AA$300,0))))","v":""},{"$f":"IF($AE$1=\"\",\"\", IF(INDEX($CB$5:$CB$300,MATCH($AE$1,$AA$5:$AA$300,0))=0, \"\", INDEX($CB$5:$CB$300,MATCH($AE$1,$AA$5:$AA$300,0))))","v":""},{"$f":"IF($AG$1=\"\",\"\", IF(INDEX($CB$5:$CB$300,MATCH($AG$1,$AA$5:$AA$300,0))=0, \"\", INDEX($CB$5:$CB$300,MATCH($AG$1,$AA$5:$AA$300,0))))","v":""}]
[null,null,null,null,null,null,null,null,null,null,null,null,null,null,null,null,null,null,null,null,null,"●運動・不器用：",{"$f":"IF($AC$1=\"\",\"\", IF(INDEX($CC$5:$CC$300,MATCH($AC$1,$AA$5:$AA$300,0))=0, \"\", INDEX($CC$5:$CC$300,MATCH($AC$1,$AA$5:$AA$300,0))))","v":""},{"$f":"IF($AE$1=\"\",\"\", IF(INDEX($CC$5:$CC$300,MATCH($AE$1,$AA$5:$AA$300,0))=0, \"\", INDEX($CC$5:$CC$300,MATCH($AE$1,$AA$5:$AA$300,0))))","v":""},{"$f":"IF($AG$1=\"\",\"\", IF(INDEX($CC$5:$CC$300,MATCH($AG$1,$AA$5:$AA$300,0))=0, \"\", INDEX($CC$5:$CC$300,MATCH($AG$1,$AA$5:$AA$300,0))))","v":""}]
[null,null,null,null,null,null,null,null,null,null,null,null,null,null,null,null,null,null,null,null,null,"●身辺自立：",{"$f":"IF($AC$1=\"\",\"\", IF(INDEX($CD$5:$CD$300,MATCH($AC$1,$AA$5:$AA$300,0))=0, \"\", INDEX($CD$5:$CD$300,MATCH($AC$1,$AA$5:$AA$300,0))))","v":""},{"$f":"IF($AE$1=\"\",\"\", IF(INDEX($CD$5:$CD$300,MATCH($AE$1,$AA$5:$AA$300,0))=0, \"\", INDEX($CD$5:$CD$300,MATCH($AE$1,$AA$5:$AA$300,0))))","v":""},{"$f":"IF($AG$1=\"\",\"\", IF(INDEX($CD$5:$CD$300,MATCH($AG$1,$AA$5:$AA$300,0))=0, \"\", INDEX($CD$5:$CD$300,MATCH($AG$1,$AA$5:$AA$300,0))))","v":""}]
[null,null,null,null,null,null,null,null,null,null,null,null,null,null,null,null,null,null,null,null,null,"●睡眠：",{"$f":"IF($AC$1=\"\",\"\", IF(INDEX($CE$5:$CE$300,MATCH($AC$1,$AA$5:$AA$300,0))=0, \"\", INDEX($CE$5:$CE$300,MATCH($AC$1,$AA$5:$AA$300,0))))","v":""},{"$f":"IF($AE$1=\"\",\"\", IF(INDEX($CE$5:$CE$300,MATCH($AE$1,$AA$5:$AA$300,0))=0, \"\", INDEX($CE$5:$CE$300,MATCH($AE$1,$AA$5:$AA$300,0))))","v":""},{"$f":"IF($AG$1=\"\",\"\", IF(INDEX($CE$5:$CE$300,MATCH($AG$1,$AA$5:$AA$300,0))=0, \"\", INDEX($CE$5:$CE$300,MATCH($AG$1,$AA$5:$AA$300,0))))","v":""}]
[null,null,null,null,null,null,null,null,null,null,null,null,null,null,null,null,null,null,null,null,null,"●不安・緘黙：",{"$f":"IF($AC$1=\"\",\"\", IF(INDEX($CF$5:$CF$300,MATCH($AC$1,$AA$5:$AA$300,0))=0, \"\", INDEX($CF$5:$CF$300,MATCH($AC$1,$AA$5:$AA$300,0))))","v":""},{"$f":"IF($AE$1=\"\",\"\", IF(INDEX($CF$5:$CF$300,MATCH($AE$1,$AA$5:$AA$300,0))=0, \"\", INDEX($CF$5:$CF$300,MATCH($AE$1,$AA$5:$AA$300,0))))","v":""},{"$f":"IF($AG$1=\"\",\"\", IF(INDEX($CF$5:$CF$300,MATCH($AG$1,$AA$5:$AA$300,0))=0, \"\", INDEX($CF$5:$CF$300,MATCH($AG$1,$AA$5:$AA$300,0))))","v":""}]
[null,null,null,null,null,null,null,null,null,null,null,null,null,null,null,null,null,null,null,null,null,"●自傷・他害行動：",{"$f":"IF($AC$1=\"\",\"\", IF(INDEX($CG$5:$CG$300,MATCH($AC$1,$AA$5:$AA$300,0))=0, \"\", INDEX($CG$5:$CG$300,MATCH($AC$1,$AA$5:$AA$300,0))))","v":""},{"$f":"IF($AE$1=\"\",\"\", IF(INDEX($CG$5:$CG$300,MATCH($AE$1,$AA$5:$AA$300,0))=0, \"\", INDEX($CG$5:$CG$300,MATCH($AE$1,$AA$5:$AA$300,0))))","v":""},{"$f":"IF($AG$1=\"\",\"\", IF(INDEX($CG$5:$CG$300,MATCH($AG$1,$AA$5:$AA$300,0))=0, \"\", INDEX($CG$5:$CG$300,MATCH($AG$1,$AA$5:$AA$300,0))))","v":""}]
[null,null,null,null,null,null,null,null,null,null,null,null,null,null,null,null,null,null,null,null,null,"●いじめの被害：",{"$f":"IF($AC$1=\"\",\"\", IF(INDEX($CH$5:$CH$300,MATCH($AC$1,$AA$5:$AA$300,0))=0, \"\", INDEX($CH$5:$CH$300,MATCH($AC$1,$AA$5:$AA$300,0))))","v":""},{"$f":"IF($AE$1=\"\",\"\", IF(INDEX($CH$5:$CH$300,MATCH($AE$1,$AA$5:$AA$300,0))=0, \"\", INDEX($CH$5:$CH$300,MATCH($AE$1,$AA$5:$AA$300,0))))","v":""},{"$f":"IF($AG$1=\"\",\"\", IF(INDEX($CH$5:$CH$300,MATCH($AG$1,$AA$5:$AA$300,0))=0, \"\", INDEX($CH$5:$CH$300,MATCH($AG$1,$AA$5:$AA$300,0))))","v":""}]
[null,null,null,null,null,null,null,null,null,null,null,null,null,null,null,null,null,null,null,null,null,"●身体状態（病弱）：",{"$f":"IF($AC$1=\"\",\"\", IF(INDEX($CI$5:$CI$300,MATCH($AC$1,$AA$5:$AA$300,0))=0, \"\", INDEX($CI$5:$CI$300,MATCH($AC$1,$AA$5:$AA$300,0))))","v":""},{"$f":"IF($AE$1=\"\",\"\", IF(INDEX($CI$5:$CI$300,MATCH($AE$1,$AA$5:$AA$300,0))=0, \"\", INDEX($CI$5:$CI$300,MATCH($AE$1,$AA$5:$AA$300,0))))","v":""},{"$f":"IF($AG$1=\"\",\"\", IF(INDEX($CI$5:$CI$300,MATCH($AG$1,$AA$5:$AA$300,0))=0, \"\", INDEX($CI$5:$CI$300,MATCH($AG$1,$AA$5:$AA$300,0))))","v":""}]
[null,null,null,null,null,null,null,null,null,null,null,null,null,null,null,null,null,null,null,null,null,"●服薬状況：",{"$f":"IF($AC$1=\"\",\"\", IF(INDEX($CJ$5:$CJ$300,MATCH($AC$1,$AA$5:$AA$300,0))=0, \"\", INDEX($CJ$5:$CJ$300,MATCH($AC$1,$AA$5:$AA$300,0))))","v":""},{"$f":"IF($AE$1=\"\",\"\", IF(INDEX($CJ$5:$CJ$300,MATCH($AE$1,$AA$5:$AA$300,0))=0, \"\", INDEX($CJ$5:$CJ$300,MATCH($AE$1,$AA$5:$AA$300,0))))","v":""},{"$f":"IF($AG$1=\"\",\"\", IF(INDEX($CJ$5:$CJ$300,MATCH($AG$1,$AA$5:$AA$300,0))=0, \"\", INDEX($CJ$5:$CJ$300,MATCH($AG$1,$AA$5:$AA$300,0))))","v":""}]
[null,null,null,null,null,null,null,null,null,null,null,null,null,null,null,null,null,null,null,null,null,"●その他：",{"$f":"IF($AC$1=\"\",\"\", IF(INDEX($CK$5:$CK$300,MATCH($AC$1,$AA$5:$AA$300,0))=0, \"\", INDEX($CK$5:$CK$300,MATCH($AC$1,$AA$5:$AA$300,0))))","v":""},{"$f":"IF($AE$1=\"\",\"\", IF(INDEX($CK$5:$CK$300,MATCH($AE$1,$AA$5:$AA$300,0))=0, \"\", INDEX($CK$5:$CK$300,MATCH($AE$1,$AA$5:$AA$300,0))))","v":"早急な対応は必要ないが，今後が心配"},{"$f":"IF($AG$1=\"\",\"\", IF(INDEX($CK$5:$CK$300,MATCH($AG$1,$AA$5:$AA$300,0))=0, \"\", INDEX($CK$5:$CK$300,MATCH($AG$1,$AA$5:$AA$300,0))))","v":""}]
[null,null,null,null,null,null,null,null,null,null,null,null,null,null,null,null,null,null,null,null,null,null,{"$f":"IF(W43=\"\",\"\",$V43&W43)&IF(W44=\"\",\"\",$V44&W44)&IF(W45=\"\",\"\",$V45&W45)&IF(W46=\"\",\"\",$V46&W46)&IF(W47=\"\",\"\",$V47&W47)&IF(W48=\"\",\"\",$V48&W48)&IF(W49=\"\",\"\",$V49&W4)&IF(W50=\"\",\"\",$V50&W50)&IF(W51=\"\",\"\",$V51&W51)&IF(W52=\"\",\"\",$V52&W52)&IF(W53=\"\",\"\",$V53&W53)&IF(W54=\"\",\"\",$V54&W54)&IF(W55=\"\",\"\",$V55&W55)&IF(W56=\"\",\"\",$V56&W56)&IF(W57=\"\",\"\",$V57&W57)&IF(W58=\"\",\"\",$V58&W58)&IF(W59=\"\",\"\",$V59&W59)&IF(W60=\"\",\"\",$V60&W60)&IF(W61=\"\",\"\",$V61&W61)&IF(W62=\"\",\"\",$V62&W62)&IF(W63=\"\",\"\",$V63&W63)&IF(W64=\"\",\"\",$V64&W64)&IF(W65=\"\",\"\",$V65&W65)&IF(W66=\"\",\"\",$V66&W66)&IF(W67=\"\",\"\",$V67&W67)&IF(W68=\"\",\"\",$V68&W68)&IF(W69=\"\",\"\",$V69&W69)","v":""},{"$f":"IF(X43=\"\",\"\",$V43&X43)&IF(X44=\"\",\"\",$V44&X44)&IF(X45=\"\",\"\",$V45&X45)&IF(X46=\"\",\"\",$V46&X46)&IF(X47=\"\",\"\",$V47&X47)&IF(X48=\"\",\"\",$V48&X48)&IF(X49=\"\",\"\",$V49&X4)&IF(X50=\"\",\"\",$V50&X50)&IF(X51=\"\",\"\",$V51&X51)&IF(X52=\"\",\"\",$V52&X52)&IF(X53=\"\",\"\",$V53&X53)&IF(X54=\"\",\"\",$V54&X54)&IF(X55=\"\",\"\",$V55&X55)&IF(X56=\"\",\"\",$V56&X56)&IF(X57=\"\",\"\",$V57&X57)&IF(X58=\"\",\"\",$V58&X58)&IF(X59=\"\",\"\",$V59&X59)&IF(X60=\"\",\"\",$V60&X60)&IF(X61=\"\",\"\",$V61&X61)&IF(X62=\"\",\"\",$V62&X62)&IF(X63=\"\",\"\",$V63&X63)&IF(X64=\"\",\"\",$V64&X64)&IF(X65=\"\",\"\",$V65&X65)&IF(X66=\"\",\"\",$V66&X66)&IF(X67=\"\",\"\",$V67&X67)&IF(X68=\"\",\"\",$V68&X68)&IF(X69=\"\",\"\",$V69&X69)","v":"●登園・登校状況：毎週月曜日は登校を渋る●知的水準・学校の成績：一部の強化についていけない●その他：早急な対応は必要ないが，今後が心配"},{"$f":"IF(Y43=\"\",\"\",$V43&Y43)&IF(Y44=\"\",\"\",$V44&Y44)&IF(Y45=\"\",\"\",$V45&Y45)&IF(Y46=\"\",\"\",$V46&Y46)&IF(Y47=\"\",\"\",$V47&Y47)&IF(Y48=\"\",\"\",$V48&Y48)&IF(Y49=\"\",\"\",$V49&Y4)&IF(Y50=\"\",\"\",$V50&Y50)&IF(Y51=\"\",\"\",$V51&Y51)&IF(Y52=\"\",\"\",$V52&Y52)&IF(Y53=\"\",\"\",$V53&Y53)&IF(Y54=\"\",\"\",$V54&Y54)&IF(Y55=\"\",\"\",$V55&Y55)&IF(Y56=\"\",\"\",$V56&Y56)&IF(Y57=\"\",\"\",$V57&Y57)&IF(Y58=\"\",\"\",$V58&Y58)&IF(Y59=\"\",\"\",$V59&Y59)&IF(Y60=\"\",\"\",$V60&Y60)&IF(Y61=\"\",\"\",$V61&Y61)&IF(Y62=\"\",\"\",$V62&Y62)&IF(Y63=\"\",\"\",$V63&Y63)&IF(Y64=\"\",\"\",$V64&Y64)&IF(Y65=\"\",\"\",$V65&Y65)&IF(Y66=\"\",\"\",$V66&Y66)&IF(Y67=\"\",\"\",$V67&Y67)&IF(Y68=\"\",\"\",$V68&Y68)&IF(Y69=\"\",\"\",$V69&Y69)","v":""}]

{"sheet":"リスト","index":2,"n_rows":38,"n_cols":24,"rows_kept":38,"cut":false,"hidden":true,"merged":[]}
["記入日y","記入日m","記入日d","生年月日y","生年月日m","生年月日d","性別","記入者種別","A1","A2","A3","A4","A5","A6","A7","A8","A9","A10","A11","A12","A13","A14","A15","A16"]
[]
[2025,1,1,2005,1,1,"1. 男","1. 自治体","1. 非常にゆとりがある","1. 非常に安定している","1. 余裕をもって対応できる","1. 手厚い","1. 非常に充実している","1. 毎日喜んで登校している","1. 非常に良い","1. 非常に良い","1. 非常に落ち着いている","1. 非常に注意深い","3. 年齢相応","1. 非常に安定している","3. ない","3. ない","1. 非常に健康","3. 服薬の必要がない"]
[2026,2,2,2006,2,2,"2. 女","2. 医療機関","2. ゆとりがある","2. 安定している","2. 対応できる","2. 十分","2. 充実している","2. 毎日登校している","2. 良い","2. 良い","2. 落ち着いている","2. 注意深い","4. 困難","2. 安定している","4. 軽度の問題","4. 軽度の被害","2. 健康","4. 定期的に服薬し，副作用がない"]
[2027,3,3,2007,3,3,null,"3. 保育所・幼稚園・こども園・学校","3. どちらともいえない","3. どちらともいえない","3. 何とか対応できる","3. 必要時に最低限","3. 必要に応じて受けられる","3. 登校をしぶるが登校している","3. 年齢相応","3. 年齢相応","3. 年齢相応","3. 年齢相応","5. 非常に困難","3. 年齢相応","5. 中度／重度の問題","5. 中度／重度の問題","3. どちらともいえない","5. 多剤併用や副作用が強く調整が必要"]
[2028,4,4,2008,4,4,null,null,"4. 苦しい","4. 支援が必要","4. 対応に苦慮している","4. 不十分","4. ほとんどない","4. 時々休む","4. 軽度の遅れがある／制限がある","4. 困難","4. 多動・衝動性が目立つ","4. 不注意が目立つ",null,"4. 軽度の不安",null,null,"4. 病弱"]
[2029,5,5,2009,5,5,null,null,"5. 非常に苦しい","5. 常に支援が必要","5. 対応に非常に苦慮している","5. ほとんどない","5. まったくない","5. ほとんど休む","5. 中等度〜重度の遅れ／制限がある","5. 非常に困難","5. 多動衝動性が非常に目立つ","5. 不注意が非常に目立つ",null,"5. 強い不安",null,null,"5. 非常に病弱"]
[2030,6,6,2010,6,6]
[2031,7,7,2011,7,7]
[2032,8,8,2012,8,8]
[2033,9,9,2013,9,9]
[2034,10,10,2014,10,10]
[2035,11,11,2015,11,11]
[2036,12,12,2016,12,12]
[2037,null,13,2017,null,13]
[2038,null,14,2018,null,14]
[2039,null,15,2019,null,15]
[2040,null,16,2020,null,16]
[null,null,17,2021,null,17]
[null,null,18,2022,null,18]
[null,null,19,2023,null,19]
[null,null,20,2024,null,20]
[null,null,21,2025,null,21]
[null,null,22,2026,null,22]
[null,null,23,2027,null,23]
[null,null,24,2028,null,24]
[null,null,25,2029,null,25]
[null,null,26,2030,null,26]
[null,null,27,2031,null,27]
[null,null,28,2032,null,28]
[null,null,29,2033,null,29]
[null,null,30,2034,null,30]
[null,null,31,2035,null,31]
[null,null,null,2036]
[null,null,null,2037]
[null,null,null,2038]
[null,null,null,2039]
[null,null,null,2040]